Ask Your Question
0

problems in Guess constructor with autogen.sh [closed]

asked 2013-03-27 13:22:23 +0100

this post is marked as community wiki

This post is a wiki. Anyone with karma >75 is welcome to improve it.

when i run autogen.sh (ubuntu), i am getting the following error:

/home/ubuntu/skunk/core/lingucomponent/source/languageguessing/guess.cxx: In constructor âGuess::Guess(const char*)â:
/home/ubuntu/skunk/core/lingucomponent/source/languageguessing/guess.cxx:60:49: error: â_TEXTCAT_RESULT_UNKNOWNâ was not declared in this scope
make[1]: *** [/home/ubuntu/skunk/core/workdir/unxlngx6.pro/CxxObject/lingucomponent/source/languageguessing/guess.o] Error 1
make[1]: *** Waiting for unfinished jobs....
make: *** [build] Error 2

what am i doing wrong?

edit retag flag offensive reopen merge delete

Closed for the following reason the question is answered, right answer was accepted by Alex Kemp
close date 2016-03-01 22:11:07.286494

1 Answer

Sort by » oldest newest most voted
1

answered 2014-08-11 11:45:31 +0100

Alex Thurgood gravatar image

Ask on the LibreOffice developer mailing list or irc, this is a user-questions oriented forum.

edit flag offensive delete link more

Question Tools

Stats

Asked: 2013-03-27 13:22:23 +0100

Seen: 86 times

Last updated: Aug 11 '14